{"text_format":"1","workbook":"xlsx","n_sheets":2,"sheets":["הצעת דיווח מכירות","טבלת קטגוריות"],"not_rendered":{"charts":0,"images":0,"macros":0,"external_links":0,"defined_names":5,"comments":1,"pivot_tables":0},"unopened":[],"bounds":{"document_bytes":16777216,"sheet_cells":100000,"rows_first":2000,"rows_last":500,"rows_between":2000,"halvings":0,"cell_chars":16384,"cell_head_chars":4096},"cells_cut":0,"cells_raw":0,"read":"whole","date_system":"1900"}

{"sheet":"הצעת דיווח מכירות","index":0,"n_rows":211,"n_cols":8,"rows_kept":211,"cut":false,"hidden":false,"merged":[]}
["קוד מ.א.י","שם פריט","קטגורית חוק  לטיפול סביבתי בציוד חשמלי ואלקטרוני ובסוללות, התשע\"ב–2012 - תוספת ראשונה","תת קטגוריה","ציוד","כמות פריטים שנמכרה לתקופה (פרוט סוללות מובנות בנפרד)\n1/3/2014-31/12/2014",null,"משקל הפריטים שנמכרה לתקופה (בטון)\n(פרוט סוללות\nמובנות בנפרד)\n1/3/2014-31/12/2014"]
[1100,null,{"$f":"IF(ISERROR(VLOOKUP($A2,'טבלת קטגוריות'!$A$1:$E$261,2,0)),\" -\",VLOOKUP($A2,'טבלת קטגוריות'!$A$1:$E$261,2,0))","v":"(1) מכשירי חימום או קירור"},{"$f":"IF(ISERROR(VLOOKUP($A2,'טבלת קטגוריות'!$A$1:$E$261,3,0)),\" -\",VLOOKUP($A2,'טבלת קטגוריות'!$A$1:$E$261,3,0))","v":"מקררים או מקפיאים"},{"$f":"IF(ISERROR(VLOOKUP($A2,'טבלת קטגוריות'!$A$1:$E$261,5,0)),\" -\",VLOOKUP($A2,'טבלת קטגוריות'!$A$1:$E$261,5,0))","v":"מקררים או מקפיאים עד 200 ליטר"}]
[3137,null,{"$f":"IF(ISERROR(VLOOKUP($A3,'טבלת קטגוריות'!$A$1:$E$261,2,0)),\" -\",VLOOKUP($A3,'טבלת קטגוריות'!$A$1:$E$261,2,0))","v":"(3) מנורות"},{"$f":"IF(ISERROR(VLOOKUP($A3,'טבלת קטגוריות'!$A$1:$E$261,3,0)),\" -\",VLOOKUP($A3,'טבלת קטגוריות'!$A$1:$E$261,3,0))","v":"גופי תאורה"},{"$f":"IF(ISERROR(VLOOKUP($A3,'טבלת קטגוריות'!$A$1:$E$261,5,0)),\" -\",VLOOKUP($A3,'טבלת קטגוריות'!$A$1:$E$261,5,0))","v":"פנס הצפה לד לתאורת גינה וחוץ מעל 50 סמ"}]
[3102,null,{"$f":"IF(ISERROR(VLOOKUP($A4,'טבלת קטגוריות'!$A$1:$E$261,2,0)),\" -\",VLOOKUP($A4,'טבלת קטגוריות'!$A$1:$E$261,2,0))","v":"(3) מנורות"},{"$f":"IF(ISERROR(VLOOKUP($A4,'טבלת קטגוריות'!$A$1:$E$261,3,0)),\" -\",VLOOKUP($A4,'טבלת קטגוריות'!$A$1:$E$261,3,0))","v":"נורות"},{"$f":"IF(ISERROR(VLOOKUP($A4,'טבלת קטגוריות'!$A$1:$E$261,5,0)),\" -\",VLOOKUP($A4,'טבלת קטגוריות'!$A$1:$E$261,5,0))","v":"מנורות LED."}]
[4001,null,{"$f":"IF(ISERROR(VLOOKUP($A5,'טבלת קטגוריות'!$A$1:$E$261,2,0)),\" -\",VLOOKUP($A5,'טבלת קטגוריות'!$A$1:$E$261,2,0))","v":"(4) מכשירי חשמל גדולים, שצלע אחת שלהם לפחות ארוכה מ-50 ס\"מ ושאינם כלולים בפרטים 1 עד 3"},{"$f":"IF(ISERROR(VLOOKUP($A5,'טבלת קטגוריות'!$A$1:$E$261,3,0)),\" -\",VLOOKUP($A5,'טבלת קטגוריות'!$A$1:$E$261,3,0))","v":"מכשירים המשמשים לבישול או לחימום מזון"},{"$f":"IF(ISERROR(VLOOKUP($A5,'טבלת קטגוריות'!$A$1:$E$261,5,0)),\" -\",VLOOKUP($A5,'טבלת קטגוריות'!$A$1:$E$261,5,0))","v":"אחר לפי טון"}]
[5102,null,{"$f":"IF(ISERROR(VLOOKUP($A6,'טבלת קטגוריות'!$A$1:$E$261,2,0)),\" -\",VLOOKUP($A6,'טבלת קטגוריות'!$A$1:$E$261,2,0))","v":"(5) מכשירי חשמל קטנים, שאף צלע שלהם לא ארוכה מ-50 ס\"מ ושאינם כלולים בפרטים 1 עד 3"},{"$f":"IF(ISERROR(VLOOKUP($A6,'טבלת קטגוריות'!$A$1:$E$261,3,0)),\" -\",VLOOKUP($A6,'טבלת קטגוריות'!$A$1:$E$261,3,0))","v":"מכשירים קטנים המשמשים לבישול ולעיבוד אחר של מזון, כגון"},{"$f":"IF(ISERROR(VLOOKUP($A6,'טבלת קטגוריות'!$A$1:$E$261,5,0)),\" -\",VLOOKUP($A6,'טבלת קטגוריות'!$A$1:$E$261,5,0))","v":"מתקן מים"}]
[6002,null,{"$f":"IF(ISERROR(VLOOKUP($A7,'טבלת קטגוריות'!$A$1:$E$261,2,0)),\" -\",VLOOKUP($A7,'טבלת קטגוריות'!$A$1:$E$261,2,0))","v":"(6) ציוד תקשורת וטכנולוגיית מידע (IT) קטן, שאף צלע שלו לא ארוכה מ-50 ס\"מ"},{"$f":"IF(ISERROR(VLOOKUP($A7,'טבלת קטגוריות'!$A$1:$E$261,3,0)),\" -\",VLOOKUP($A7,'טבלת קטגוריות'!$A$1:$E$261,3,0))","v":"ציוד משרדי"},{"$f":"IF(ISERROR(VLOOKUP($A7,'טבלת קטגוריות'!$A$1:$E$261,5,0)),\" -\",VLOOKUP($A7,'טבלת קטגוריות'!$A$1:$E$261,5,0))","v":"ציוד משרדי – כגון: מדפסות ,סורקים , מכשירי כריכה ולמינציה,אחר"}]
[7004,null,{"$f":"IF(ISERROR(VLOOKUP($A8,'טבלת קטגוריות'!$A$1:$E$261,2,0)),\" -\",VLOOKUP($A8,'טבלת קטגוריות'!$A$1:$E$261,2,0))","v":"סוללות אחר"},{"$f":"IF(ISERROR(VLOOKUP($A8,'טבלת קטגוריות'!$A$1:$E$261,3,0)),\" -\",VLOOKUP($A8,'טבלת קטגוריות'!$A$1:$E$261,3,0))","v":0},{"$f":"IF(ISERROR(VLOOKUP($A8,'טבלת קטגוריות'!$A$1:$E$261,5,0)),\" -\",VLOOKUP($A8,'טבלת קטגוריות'!$A$1:$E$261,5,0))","v":0}]
[null,null,{"$f":"IF(ISERROR(VLOOKUP($A9,'טבלת קטגוריות'!$A$1:$E$261,2,0)),\" -\",VLOOKUP($A9,'טבלת קטגוריות'!$A$1:$E$261,2,0))","v":" -"},{"$f":"IF(ISERROR(VLOOKUP($A9,'טבלת קטגוריות'!$A$1:$E$261,3,0)),\" -\",VLOOKUP($A9,'טבלת קטגוריות'!$A$1:$E$261,3,0))","v":" -"},{"$f":"IF(ISERROR(VLOOKUP($A9,'טבלת קטגוריות'!$A$1:$E$261,5,0)),\" -\",VLOOKUP($A9,'טבלת קטגוריות'!$A$1:$E$261,5,0))","v":" -"}]
[null,null,{"$f":"IF(ISERROR(VLOOKUP($A10,'טבלת קטגוריות'!$A$1:$E$261,2,0)),\" -\",VLOOKUP($A10,'טבלת קטגוריות'!$A$1:$E$261,2,0))","v":" -"},{"$f":"IF(ISERROR(VLOOKUP($A10,'טבלת קטגוריות'!$A$1:$E$261,3,0)),\" -\",VLOOKUP($A10,'טבלת קטגוריות'!$A$1:$E$261,3,0))","v":" -"},{"$f":"IF(ISERROR(VLOOKUP($A10,'טבלת קטגוריות'!$A$1:$E$261,5,0)),\" -\",VLOOKUP($A10,'טבלת קטגוריות'!$A$1:$E$261,5,0))","v":" -"}]
[null,null,{"$f":"IF(ISERROR(VLOOKUP($A11,'טבלת קטגוריות'!$A$1:$E$261,2,0)),\" -\",VLOOKUP($A11,'טבלת קטגוריות'!$A$1:$E$261,2,0))","v":" -"},{"$f":"IF(ISERROR(VLOOKUP($A11,'טבלת קטגוריות'!$A$1:$E$261,3,0)),\" -\",VLOOKUP($A11,'טבלת קטגוריות'!$A$1:$E$261,3,0))","v":" -"},{"$f":"IF(ISERROR(VLOOKUP($A11,'טבלת קטגוריות'!$A$1:$E$261,5,0)),\" -\",VLOOKUP($A11,'טבלת קטגוריות'!$A$1:$E$261,5,0))","v":" -"}]
[null,null,{"$f":"IF(ISERROR(VLOOKUP($A12,'טבלת קטגוריות'!$A$1:$E$261,2,0)),\" -\",VLOOKUP($A12,'טבלת קטגוריות'!$A$1:$E$261,2,0))","v":" -"},{"$f":"IF(ISERROR(VLOOKUP($A12,'טבלת קטגוריות'!$A$1:$E$261,3,0)),\" -\",VLOOKUP($A12,'טבלת קטגוריות'!$A$1:$E$261,3,0))","v":" -"},{"$f":"IF(ISERROR(VLOOKUP($A12,'טבלת קטגוריות'!$A$1:$E$261,5,0)),\" -\",VLOOKUP($A12,'טבלת קטגוריות'!$A$1:$E$261,5,0))","v":" -"}]
[null,null,{"$f":"IF(ISERROR(VLOOKUP($A13,'טבלת קטגוריות'!$A$1:$E$261,2,0)),\" -\",VLOOKUP($A13,'טבלת קטגוריות'!$A$1:$E$261,2,0))","v":" -"},{"$f":"IF(ISERROR(VLOOKUP($A13,'טבלת קטגוריות'!$A$1:$E$261,3,0)),\" -\",VLOOKUP($A13,'טבלת קטגוריות'!$A$1:$E$261,3,0))","v":" -"},{"$f":"IF(ISERROR(VLOOKUP($A13,'טבלת קטגוריות'!$A$1:$E$261,5,0)),\" -\",VLOOKUP($A13,'טבלת קטגוריות'!$A$1:$E$261,5,0))","v":" -"}]
[null,null,{"$f":"IF(ISERROR(VLOOKUP($A14,'טבלת קטגוריות'!$A$1:$E$261,2,0)),\" -\",VLOOKUP($A14,'טבלת קטגוריות'!$A$1:$E$261,2,0))","v":" -"},{"$f":"IF(ISERROR(VLOOKUP($A14,'טבלת קטגוריות'!$A$1:$E$261,3,0)),\" -\",VLOOKUP($A14,'טבלת קטגוריות'!$A$1:$E$261,3,0))","v":" -"},{"$f":"IF(ISERROR(VLOOKUP($A14,'טבלת קטגוריות'!$A$1:$E$261,5,0)),\" -\",VLOOKUP($A14,'טבלת קטגוריות'!$A$1:$E$261,5,0))","v":" -"}]
[null,null,{"$f":"IF(ISERROR(VLOOKUP($A15,'טבלת קטגוריות'!$A$1:$E$261,2,0)),\" -\",VLOOKUP($A15,'טבלת קטגוריות'!$A$1:$E$261,2,0))","v":" -"},{"$f":"IF(ISERROR(VLOOKUP($A15,'טבלת קטגוריות'!$A$1:$E$261,3,0)),\" -\",VLOOKUP($A15,'טבלת קטגוריות'!$A$1:$E$261,3,0))","v":" -"},{"$f":"IF(ISERROR(VLOOKUP($A15,'טבלת קטגוריות'!$A$1:$E$261,5,0)),\" -\",VLOOKUP($A15,'טבלת קטגוריות'!$A$1:$E$261,5,0))","v":" -"}]
[null,null,{"$f":"IF(ISERROR(VLOOKUP($A16,'טבלת קטגוריות'!$A$1:$E$261,2,0)),\" -\",VLOOKUP($A16,'טבלת קטגוריות'!$A$1:$E$261,2,0))","v":" -"},{"$f":"IF(ISERROR(VLOOKUP($A16,'טבלת קטגוריות'!$A$1:$E$261,3,0)),\" -\",VLOOKUP($A16,'טבלת קטגוריות'!$A$1:$E$261,3,0))","v":" -"},{"$f":"IF(ISERROR(VLOOKUP($A16,'טבלת קטגוריות'!$A$1:$E$261,5,0)),\" -\",VLOOKUP($A16,'טבלת קטגוריות'!$A$1:$E$261,5,0))","v":" -"}]
[null,null,{"$f":"IF(ISERROR(VLOOKUP($A17,'טבלת קטגוריות'!$A$1:$E$261,2,0)),\" -\",VLOOKUP($A17,'טבלת קטגוריות'!$A$1:$E$261,2,0))","v":" -"},{"$f":"IF(ISERROR(VLOOKUP($A17,'טבלת קטגוריות'!$A$1:$E$261,3,0)),\" -\",VLOOKUP($A17,'טבלת קטגוריות'!$A$1:$E$261,3,0))","v":" -"},{"$f":"IF(ISERROR(VLOOKUP($A17,'טבלת קטגוריות'!$A$1:$E$261,5,0)),\" -\",VLOOKUP($A17,'טבלת קטגוריות'!$A$1:$E$261,5,0))","v":" -"}]
[null,null,{"$f":"IF(ISERROR(VLOOKUP($A18,'טבלת קטגוריות'!$A$1:$E$261,2,0)),\" -\",VLOOKUP($A18,'טבלת קטגוריות'!$A$1:$E$261,2,0))","v":" -"},{"$f":"IF(ISERROR(VLOOKUP($A18,'טבלת קטגוריות'!$A$1:$E$261,3,0)),\" -\",VLOOKUP($A18,'טבלת קטגוריות'!$A$1:$E$261,3,0))","v":" -"},{"$f":"IF(ISERROR(VLOOKUP($A18,'טבלת קטגוריות'!$A$1:$E$261,5,0)),\" -\",VLOOKUP($A18,'טבלת קטגוריות'!$A$1:$E$261,5,0))","v":" -"}]
[null,null,{"$f":"IF(ISERROR(VLOOKUP($A19,'טבלת קטגוריות'!$A$1:$E$261,2,0)),\" -\",VLOOKUP($A19,'טבלת קטגוריות'!$A$1:$E$261,2,0))","v":" -"},{"$f":"IF(ISERROR(VLOOKUP($A19,'טבלת קטגוריות'!$A$1:$E$261,3,0)),\" -\",VLOOKUP($A19,'טבלת קטגוריות'!$A$1:$E$261,3,0))","v":" -"},{"$f":"IF(ISERROR(VLOOKUP($A19,'טבלת קטגוריות'!$A$1:$E$261,5,0)),\" -\",VLOOKUP($A19,'טבלת קטגוריות'!$A$1:$E$261,5,0))","v":" -"}]
[null,null,{"$f":"IF(ISERROR(VLOOKUP($A20,'טבלת קטגוריות'!$A$1:$E$261,2,0)),\" -\",VLOOKUP($A20,'טבלת קטגוריות'!$A$1:$E$261,2,0))","v":" -"},{"$f":"IF(ISERROR(VLOOKUP($A20,'טבלת קטגוריות'!$A$1:$E$261,3,0)),\" -\",VLOOKUP($A20,'טבלת קטגוריות'!$A$1:$E$261,3,0))","v":" -"},{"$f":"IF(ISERROR(VLOOKUP($A20,'טבלת קטגוריות'!$A$1:$E$261,5,0)),\" -\",VLOOKUP($A20,'טבלת קטגוריות'!$A$1:$E$261,5,0))","v":" -"}]
[null,null,{"$f":"IF(ISERROR(VLOOKUP($A21,'טבלת קטגוריות'!$A$1:$E$261,2,0)),\" -\",VLOOKUP($A21,'טבלת קטגוריות'!$A$1:$E$261,2,0))","v":" -"},{"$f":"IF(ISERROR(VLOOKUP($A21,'טבלת קטגוריות'!$A$1:$E$261,3,0)),\" -\",VLOOKUP($A21,'טבלת קטגוריות'!$A$1:$E$261,3,0))","v":" -"},{"$f":"IF(ISERROR(VLOOKUP($A21,'טבלת קטגוריות'!$A$1:$E$261,5,0)),\" -\",VLOOKUP($A21,'טבלת קטגוריות'!$A$1:$E$261,5,0))","v":" -"}]
[null,null,{"$f":"IF(ISERROR(VLOOKUP($A22,'טבלת קטגוריות'!$A$1:$E$261,2,0)),\" -\",VLOOKUP($A22,'טבלת קטגוריות'!$A$1:$E$261,2,0))","v":" -"},{"$f":"IF(ISERROR(VLOOKUP($A22,'טבלת קטגוריות'!$A$1:$E$261,3,0)),\" -\",VLOOKUP($A22,'טבלת קטגוריות'!$A$1:$E$261,3,0))","v":" -"},{"$f":"IF(ISERROR(VLOOKUP($A22,'טבלת קטגוריות'!$A$1:$E$261,5,0)),\" -\",VLOOKUP($A22,'טבלת קטגוריות'!$A$1:$E$261,5,0))","v":" -"}]
[null,null,{"$f":"IF(ISERROR(VLOOKUP($A23,'טבלת קטגוריות'!$A$1:$E$261,2,0)),\" -\",VLOOKUP($A23,'טבלת קטגוריות'!$A$1:$E$261,2,0))","v":" -"},{"$f":"IF(ISERROR(VLOOKUP($A23,'טבלת קטגוריות'!$A$1:$E$261,3,0)),\" -\",VLOOKUP($A23,'טבלת קטגוריות'!$A$1:$E$261,3,0))","v":" -"},{"$f":"IF(ISERROR(VLOOKUP($A23,'טבלת קטגוריות'!$A$1:$E$261,5,0)),\" -\",VLOOKUP($A23,'טבלת קטגוריות'!$A$1:$E$261,5,0))","v":" -"}]
[null,null,{"$f":"IF(ISERROR(VLOOKUP($A24,'טבלת קטגוריות'!$A$1:$E$261,2,0)),\" -\",VLOOKUP($A24,'טבלת קטגוריות'!$A$1:$E$261,2,0))","v":" -"},{"$f":"IF(ISERROR(VLOOKUP($A24,'טבלת קטגוריות'!$A$1:$E$261,3,0)),\" -\",VLOOKUP($A24,'טבלת קטגוריות'!$A$1:$E$261,3,0))","v":" -"},{"$f":"IF(ISERROR(VLOOKUP($A24,'טבלת קטגוריות'!$A$1:$E$261,5,0)),\" -\",VLOOKUP($A24,'טבלת קטגוריות'!$A$1:$E$261,5,0))","v":" -"}]
[null,null,{"$f":"IF(ISERROR(VLOOKUP($A25,'טבלת קטגוריות'!$A$1:$E$261,2,0)),\" -\",VLOOKUP($A25,'טבלת קטגוריות'!$A$1:$E$261,2,0))","v":" -"},{"$f":"IF(ISERROR(VLOOKUP($A25,'טבלת קטגוריות'!$A$1:$E$261,3,0)),\" -\",VLOOKUP($A25,'טבלת קטגוריות'!$A$1:$E$261,3,0))","v":" -"},{"$f":"IF(ISERROR(VLOOKUP($A25,'טבלת קטגוריות'!$A$1:$E$261,5,0)),\" -\",VLOOKUP($A25,'טבלת קטגוריות'!$A$1:$E$261,5,0))","v":" -"}]
[null,null,{"$f":"IF(ISERROR(VLOOKUP($A26,'טבלת קטגוריות'!$A$1:$E$261,2,0)),\" -\",VLOOKUP($A26,'טבלת קטגוריות'!$A$1:$E$261,2,0))","v":" -"},{"$f":"IF(ISERROR(VLOOKUP($A26,'טבלת קטגוריות'!$A$1:$E$261,3,0)),\" -\",VLOOKUP($A26,'טבלת קטגוריות'!$A$1:$E$261,3,0))","v":" -"},{"$f":"IF(ISERROR(VLOOKUP($A26,'טבלת קטגוריות'!$A$1:$E$261,5,0)),\" -\",VLOOKUP($A26,'טבלת קטגוריות'!$A$1:$E$261,5,0))","v":" -"}]
[null,null,{"$f":"IF(ISERROR(VLOOKUP($A27,'טבלת קטגוריות'!$A$1:$E$261,2,0)),\" -\",VLOOKUP($A27,'טבלת קטגוריות'!$A$1:$E$261,2,0))","v":" -"},{"$f":"IF(ISERROR(VLOOKUP($A27,'טבלת קטגוריות'!$A$1:$E$261,3,0)),\" -\",VLOOKUP($A27,'טבלת קטגוריות'!$A$1:$E$261,3,0))","v":" -"},{"$f":"IF(ISERROR(VLOOKUP($A27,'טבלת קטגוריות'!$A$1:$E$261,5,0)),\" -\",VLOOKUP($A27,'טבלת קטגוריות'!$A$1:$E$261,5,0))","v":" -"}]
[null,null,{"$f":"IF(ISERROR(VLOOKUP($A28,'טבלת קטגוריות'!$A$1:$E$261,2,0)),\" -\",VLOOKUP($A28,'טבלת קטגוריות'!$A$1:$E$261,2,0))","v":" -"},{"$f":"IF(ISERROR(VLOOKUP($A28,'טבלת קטגוריות'!$A$1:$E$261,3,0)),\" -\",VLOOKUP($A28,'טבלת קטגוריות'!$A$1:$E$261,3,0))","v":" -"},{"$f":"IF(ISERROR(VLOOKUP($A28,'טבלת קטגוריות'!$A$1:$E$261,5,0)),\" -\",VLOOKUP($A28,'טבלת קטגוריות'!$A$1:$E$261,5,0))","v":" -"}]
[null,null,{"$f":"IF(ISERROR(VLOOKUP($A29,'טבלת קטגוריות'!$A$1:$E$261,2,0)),\" -\",VLOOKUP($A29,'טבלת קטגוריות'!$A$1:$E$261,2,0))","v":" -"},{"$f":"IF(ISERROR(VLOOKUP($A29,'טבלת קטגוריות'!$A$1:$E$261,3,0)),\" -\",VLOOKUP($A29,'טבלת קטגוריות'!$A$1:$E$261,3,0))","v":" -"},{"$f":"IF(ISERROR(VLOOKUP($A29,'טבלת קטגוריות'!$A$1:$E$261,5,0)),\" -\",VLOOKUP($A29,'טבלת קטגוריות'!$A$1:$E$261,5,0))","v":" -"}]
[null,null,{"$f":"IF(ISERROR(VLOOKUP($A30,'טבלת קטגוריות'!$A$1:$E$261,2,0)),\" -\",VLOOKUP($A30,'טבלת קטגוריות'!$A$1:$E$261,2,0))","v":" -"},{"$f":"IF(ISERROR(VLOOKUP($A30,'טבלת קטגוריות'!$A$1:$E$261,3,0)),\" -\",VLOOKUP($A30,'טבלת קטגוריות'!$A$1:$E$261,3,0))","v":" -"},{"$f":"IF(ISERROR(VLOOKUP($A30,'טבלת קטגוריות'!$A$1:$E$261,5,0)),\" -\",VLOOKUP($A30,'טבלת קטגוריות'!$A$1:$E$261,5,0))","v":" -"}]
[null,null,{"$f":"IF(ISERROR(VLOOKUP($A31,'טבלת קטגוריות'!$A$1:$E$261,2,0)),\" -\",VLOOKUP($A31,'טבלת קטגוריות'!$A$1:$E$261,2,0))","v":" -"},{"$f":"IF(ISERROR(VLOOKUP($A31,'טבלת קטגוריות'!$A$1:$E$261,3,0)),\" -\",VLOOKUP($A31,'טבלת קטגוריות'!$A$1:$E$261,3,0))","v":" -"},{"$f":"IF(ISERROR(VLOOKUP($A31,'טבלת קטגוריות'!$A$1:$E$261,5,0)),\" -\",VLOOKUP($A31,'טבלת קטגוריות'!$A$1:$E$261,5,0))","v":" -"}]
[null,null,{"$f":"IF(ISERROR(VLOOKUP($A32,'טבלת קטגוריות'!$A$1:$E$261,2,0)),\" -\",VLOOKUP($A32,'טבלת קטגוריות'!$A$1:$E$261,2,0))","v":" -"},{"$f":"IF(ISERROR(VLOOKUP($A32,'טבלת קטגוריות'!$A$1:$E$261,3,0)),\" -\",VLOOKUP($A32,'טבלת קטגוריות'!$A$1:$E$261,3,0))","v":" -"},{"$f":"IF(ISERROR(VLOOKUP($A32,'טבלת קטגוריות'!$A$1:$E$261,5,0)),\" -\",VLOOKUP($A32,'טבלת קטגוריות'!$A$1:$E$261,5,0))","v":" -"}]
[null,null,{"$f":"IF(ISERROR(VLOOKUP($A33,'טבלת קטגוריות'!$A$1:$E$261,2,0)),\" -\",VLOOKUP($A33,'טבלת קטגוריות'!$A$1:$E$261,2,0))","v":" -"},{"$f":"IF(ISERROR(VLOOKUP($A33,'טבלת קטגוריות'!$A$1:$E$261,3,0)),\" -\",VLOOKUP($A33,'טבלת קטגוריות'!$A$1:$E$261,3,0))","v":" -"},{"$f":"IF(ISERROR(VLOOKUP($A33,'טבלת קטגוריות'!$A$1:$E$261,5,0)),\" -\",VLOOKUP($A33,'טבלת קטגוריות'!$A$1:$E$261,5,0))","v":" -"}]
[null,null,{"$f":"IF(ISERROR(VLOOKUP($A34,'טבלת קטגוריות'!$A$1:$E$261,2,0)),\" -\",VLOOKUP($A34,'טבלת קטגוריות'!$A$1:$E$261,2,0))","v":" -"},{"$f":"IF(ISERROR(VLOOKUP($A34,'טבלת קטגוריות'!$A$1:$E$261,3,0)),\" -\",VLOOKUP($A34,'טבלת קטגוריות'!$A$1:$E$261,3,0))","v":" -"},{"$f":"IF(ISERROR(VLOOKUP($A34,'טבלת קטגוריות'!$A$1:$E$261,5,0)),\" -\",VLOOKUP($A34,'טבלת קטגוריות'!$A$1:$E$261,5,0))","v":" -"}]
[null,null,{"$f":"IF(ISERROR(VLOOKUP($A35,'טבלת קטגוריות'!$A$1:$E$261,2,0)),\" -\",VLOOKUP($A35,'טבלת קטגוריות'!$A$1:$E$261,2,0))","v":" -"},{"$f":"IF(ISERROR(VLOOKUP($A35,'טבלת קטגוריות'!$A$1:$E$261,3,0)),\" -\",VLOOKUP($A35,'טבלת קטגוריות'!$A$1:$E$261,3,0))","v":" -"},{"$f":"IF(ISERROR(VLOOKUP($A35,'טבלת קטגוריות'!$A$1:$E$261,5,0)),\" -\",VLOOKUP($A35,'טבלת קטגוריות'!$A$1:$E$261,5,0))","v":" -"}]
[null,null,{"$f":"IF(ISERROR(VLOOKUP($A36,'טבלת קטגוריות'!$A$1:$E$261,2,0)),\" -\",VLOOKUP($A36,'טבלת קטגוריות'!$A$1:$E$261,2,0))","v":" -"},{"$f":"IF(ISERROR(VLOOKUP($A36,'טבלת קטגוריות'!$A$1:$E$261,3,0)),\" -\",VLOOKUP($A36,'טבלת קטגוריות'!$A$1:$E$261,3,0))","v":" -"},{"$f":"IF(ISERROR(VLOOKUP($A36,'טבלת קטגוריות'!$A$1:$E$261,5,0)),\" -\",VLOOKUP($A36,'טבלת קטגוריות'!$A$1:$E$261,5,0))","v":" -"}]
[null,null,{"$f":"IF(ISERROR(VLOOKUP($A37,'טבלת קטגוריות'!$A$1:$E$261,2,0)),\" -\",VLOOKUP($A37,'טבלת קטגוריות'!$A$1:$E$261,2,0))","v":" -"},{"$f":"IF(ISERROR(VLOOKUP($A37,'טבלת קטגוריות'!$A$1:$E$261,3,0)),\" -\",VLOOKUP($A37,'טבלת קטגוריות'!$A$1:$E$261,3,0))","v":" -"},{"$f":"IF(ISERROR(VLOOKUP($A37,'טבלת קטגוריות'!$A$1:$E$261,5,0)),\" -\",VLOOKUP($A37,'טבלת קטגוריות'!$A$1:$E$261,5,0))","v":" -"}]
[null,null,{"$f":"IF(ISERROR(VLOOKUP($A38,'טבלת קטגוריות'!$A$1:$E$261,2,0)),\" -\",VLOOKUP($A38,'טבלת קטגוריות'!$A$1:$E$261,2,0))","v":" -"},{"$f":"IF(ISERROR(VLOOKUP($A38,'טבלת קטגוריות'!$A$1:$E$261,3,0)),\" -\",VLOOKUP($A38,'טבלת קטגוריות'!$A$1:$E$261,3,0))","v":" -"},{"$f":"IF(ISERROR(VLOOKUP($A38,'טבלת קטגוריות'!$A$1:$E$261,5,0)),\" -\",VLOOKUP($A38,'טבלת קטגוריות'!$A$1:$E$261,5,0))","v":" -"}]
[null,null,{"$f":"IF(ISERROR(VLOOKUP($A39,'טבלת קטגוריות'!$A$1:$E$261,2,0)),\" -\",VLOOKUP($A39,'טבלת קטגוריות'!$A$1:$E$261,2,0))","v":" -"},{"$f":"IF(ISERROR(VLOOKUP($A39,'טבלת קטגוריות'!$A$1:$E$261,3,0)),\" -\",VLOOKUP($A39,'טבלת קטגוריות'!$A$1:$E$261,3,0))","v":" -"},{"$f":"IF(ISERROR(VLOOKUP($A39,'טבלת קטגוריות'!$A$1:$E$261,5,0)),\" -\",VLOOKUP($A39,'טבלת קטגוריות'!$A$1:$E$261,5,0))","v":" -"}]
[null,null,{"$f":"IF(ISERROR(VLOOKUP($A40,'טבלת קטגוריות'!$A$1:$E$261,2,0)),\" -\",VLOOKUP($A40,'טבלת קטגוריות'!$A$1:$E$261,2,0))","v":" -"},{"$f":"IF(ISERROR(VLOOKUP($A40,'טבלת קטגוריות'!$A$1:$E$261,3,0)),\" -\",VLOOKUP($A40,'טבלת קטגוריות'!$A$1:$E$261,3,0))","v":" -"},{"$f":"IF(ISERROR(VLOOKUP($A40,'טבלת קטגוריות'!$A$1:$E$261,5,0)),\" -\",VLOOKUP($A40,'טבלת קטגוריות'!$A$1:$E$261,5,0))","v":" -"}]
{"$rows_left_out":172}
{"sheet":"טבלת קטגוריות","index":1,"n_rows":254,"n_cols":7,"rows_kept":254,"cut":false,"hidden":false,"merged":[[251,1,251,2],[252,1,252,2],[253,1,253,2],[246,2,246,4],[249,1,249,2],[250,1,250,2]]}
["קוד מ.א.י","קטגורית החוק - תוספת ראשונה","תת קטגוריה",null,"ציוד","מחיר חדש החל  מ- 1.1.2016","מחירון 2015 (החל מ 1 באפריל)"]
[1100,"(1) מכשירי חימום או קירור","מקררים או מקפיאים",101,"מקררים או מקפיאים עד 200 ליטר",3.18,3.3]
[1101,"(1) מכשירי חימום או קירור","מקררים או מקפיאים",101,"מקררים  או מקפיאים 200 ליטר עד 400 ליטר",7.62,8]
[1102,"(1) מכשירי חימום או קירור","מקררים או מקפיאים",101,"מקררים או מקפיאים מ 400 ליטר עד 600 ליטר",9.7799999999999994,9.85]
[1103,"(1) מכשירי חימום או קירור","מקררים או מקפיאים",101,"מקררים או מקפיאים מעל 600 ליטר",12.32,12.45]
[1104,"(1) מכשירי חימום או קירור","מזגנים",102,"מזגן עילי עד 1.5 כ\"ס",6.04,6.39]
[1105,"(1) מכשירי חימום או קירור","מזגנים",102,"מזגן עילי מעל 1.5 כ\"ס",7.55,7.56]
[1106,"(1) מכשירי חימום או קירור","מזגנים",102,"מזגן עילי השאר",7.55,7.92]
[1107,"(1) מכשירי חימום או קירור","מזגנים",102,"מזגן מיני מרכזי עד 3.5 כס",11.78,13.1]
[1108,"(1) מכשירי חימום או קירור","מזגנים",102,"מזגן מיני מרכזי מעל 3.5 כס",15.1,16.899999999999999]
[1109,"(1) מכשירי חימום או קירור","מזגנים",102,"מזגן מוסדי או אחר",16.61,18.100000000000001]
[1120,"(1) מכשירי חימום או קירור","מזגנים",103,"מאיידים בטכנולוגיית מים",6.5100000000000007,7]
[1110,"(1) מכשירי חימום או קירור","מכשירי אדים, קולטי לחות",103,"מכשירי אדים, קולטי לחות עד 20 ק\"ג",0.84,1]
[1111,"(1) מכשירי חימום או קירור","מכשירי אדים, קולטי לחות",104,"מכשירי אדים, קולטי לחות מעל 20 קג",3.6,4]
[1112,"(1) מכשירי חימום או קירור","משאבות חום, מתקני הסקה",104,"משאבות חום, מתקני הסקה",7.75,8]
[1113,"(1) מכשירי חימום או קירור","משאבות חום, מתקני הסקה",104,"מפזר חום מחוץ לבית",1.55,1.6]
[1114,"(1) מכשירי חימום או קירור","משאבות חום, מתקני הסקה",104,"מפזר חום ביתי",0.3,0.3]
[1115,"(1) מכשירי חימום או קירור","משאבות חום, מתקני הסקה",104,"רדיאטור",0.99,1]
[1199,"(1) מכשירי חימום או קירור",null,104,"לפי טון",135,150]
[2100,"(2) מסכים, צגים ומכשירים הכוללים מסכים","טלוויזיה ומסכים",201,"מסך מעל 60\"",5.08,5.7]
[2101,"(2) מסכים, צגים ומכשירים הכוללים מסכים","טלוויזיה ומסכים",201,"מסך מעל 50\" ועד 60\"",4.38,4.8]
[2102,"(2) מסכים, צגים ומכשירים הכוללים מסכים","טלוויזיה ומסכים",201,"מסך מעל 40\" ועד 50\"",3.15,3.38]
[2103,"(2) מסכים, צגים ומכשירים הכוללים מסכים","טלוויזיה ומסכים",201,"מסך מעל 37\" ועד 40\"",2.0099999999999998,2.1]
[2104,"(2) מסכים, צגים ומכשירים הכוללים מסכים","טלוויזיה ומסכים",201,"מסך מעל 27\" ועד 36\"",1.28,1.28]
[2105,"(2) מסכים, צגים ומכשירים הכוללים מסכים","טלוויזיה ומסכים",201,"מסך מעל 24\" ועד 27\"",0.67,0.68]
[2106,"(2) מסכים, צגים ומכשירים הכוללים מסכים","טלוויזיה ומסכים",201,"מסך מעל 15\" ועד 24\"",0.6,0.6]
[2107,"(2) מסכים, צגים ומכשירים הכוללים מסכים","מחשבים",201,"מחשב נייד או טאבלט",0.57999999999999996,0.6]
[3100,"(3) מנורות","נורות",301,"מנורות פלורוסנט (ישרות, קומפקטיות ואחרות),",0.09,0.14000000000000001]
[3101,"(3) מנורות","נורות",301,"מנורות קסנון (HID)",0.18,0.27]
[3102,"(3) מנורות","נורות",301,"מנורות LED.",0.03,0.03]
[3103,"(3) מנורות","נורות",301,"מנורות המכילות גז נתרן בלחץ ומנורות מתכת האליד, מנורות המכילות גז נתרן בלחץ נמוך ואחר",0.18,0.18]
[3110,"(3) מנורות","נורות",301,"פסי LED חמישה מטר",0.08,0.1]
[3001,"(3) מנורות","נורות",301,"אחר לפי טון",900,1700]
[3104,"(3) מנורות","גופי תאורה",302,"גופי תאורה שאף צלע לא עוברת 50 סמ",0.03,0.03]
[3105,"(3) מנורות","גופי תאורה",302,"גופי תאורה שיש צלע מעל 50 סמ עבור נורה בודדת",0.03,0.03]
[3106,"(3) מנורות","גופי תאורה",302,"גופי תאורה שיש צלע מעל 50 סמ לכמה נורות",0.1,0.12]
[3107,"(3) מנורות","גופי תאורה",302,"נברשות עד 8 ק\"ג",1.6666666666666667,2]
[3108,"(3) מנורות","גופי תאורה",302,"נברשות עד 15 ק\"ג",3.1666666666666665,3.8]
[3109,"(3) מנורות","גופי תאורה",302,"הנברשות מעל 15 ק\"ג",7.416666666666667,8.9]
[3120,"(3) מנורות","גופי תאורה",302,"זרקור תנועה חכם  עד 30 קג",1.875,2.25]
{"$rows_left_out":214}